Reaction Details
Target5-hydroxytryptamine receptor 7
LigandBDBM50216039
Substrate/Competitorn/a
Meas. Tech.ChEMBL_563397 (CHEMBL959382)
Ki 74±n/a nM
Citation Medina, RASallander, JBenhamú, BPorras, ECampillo, MPardo, LLópez-Rodríguez, ML Synthesis of new serotonin 5-HT7 receptor ligands. Determinants of 5-HT7/5-HT1A receptor selectivity. J Med Chem52:2384-92 (2009) 
 
5-hydroxytryptamine receptor 7
Name:5-hydroxytryptamine receptor 7
Type:G Protein-Coupled Receptor (GPCR)
Mol. Mass.:53573.08
Organism:Homo sapiens (Human)
Description:P34969
Residue:479
BDBM50216039
NameBDBM50216039
Synonyms:1-(4-(4-(2-methoxyphenyl)-1-piperazinyl)butyl)-indolin-2-one CHEMBL395933
TypeSmall organic molecule
Emp. Form.C22H27N3O
Mol. Mass.349.4693
SMILESO=C1Cc2ccccc2N1CCCCN1CCN(CC1)c1ccccc1