Reaction Details
Target5-hydroxytryptamine receptor 7
LigandBDBM50267832
Substrate/Competitorn/a
Meas. Tech.ChEMBL_563397 (CHEMBL959382)
Ki 7±n/a nM
Citation Medina, RASallander, JBenhamú, BPorras, ECampillo, MPardo, LLópez-Rodríguez, ML Synthesis of new serotonin 5-HT7 receptor ligands. Determinants of 5-HT7/5-HT1A receptor selectivity. J Med Chem52:2384-92 (2009) 
 
5-hydroxytryptamine receptor 7
Name:5-hydroxytryptamine receptor 7
Type:G Protein-Coupled Receptor (GPCR)
Mol. Mass.:53573.08
Organism:Homo sapiens (Human)
Description:P34969
Residue:479
BDBM50267832
NameBDBM50267832
Synonyms:1-[4-(3,4-Dihydroisoquinolin-2(1H)-yl)butyl]-1,3-dihydro-2Hindol-2-one | CHEMBL445334
TypeSmall organic molecule
Emp. Form.C21H24N2O
Mol. Mass.320.4281
SMILESO=C1Cc2ccccc2N1CCCCN1CCc2ccccc2C1