Reaction Details
Target5-hydroxytryptamine receptor 1A
LigandBDBM50267738
Substrate/Competitorn/a
Meas. Tech.ChEMBL_563399 (CHEMBL960151)
Ki 18.1±n/a nM
Citation Medina, RASallander, JBenhamú, BPorras, ECampillo, MPardo, LLópez-Rodríguez, ML Synthesis of new serotonin 5-HT7 receptor ligands. Determinants of 5-HT7/5-HT1A receptor selectivity. J Med Chem52:2384-92 (2009) 
 
5-hydroxytryptamine receptor 1A
Name:5-hydroxytryptamine receptor 1A
Type:n/a
Mol. Mass.:46122.49
Organism:Homo sapiens (Human)
Description:n/a
Residue:422
BDBM50267738
NameBDBM50267738
Synonyms:1-{5-[4-(1H)-benzimidazol-4-yl)piperazin-1-yl]pentyl}-1,3-dihydro-2H-indol-2-one | CHEMBL523121
TypeSmall organic molecule
Emp. Form.C24H29N5O
Mol. Mass.403.52
SMILESO=C1Cc2ccccc2N1CCCCCN1CCN(CC1)c1cccc2[nH]cnc12