Reaction Details
Target5-hydroxytryptamine receptor 1A
LigandBDBM50267833
Substrate/Competitorn/a
Meas. Tech.ChEMBL_563399 (CHEMBL960151)
Ki>1000±n/a nM
Citation Medina, RASallander, JBenhamú, BPorras, ECampillo, MPardo, LLópez-Rodríguez, ML Synthesis of new serotonin 5-HT7 receptor ligands. Determinants of 5-HT7/5-HT1A receptor selectivity. J Med Chem52:2384-92 (2009) 
 
5-hydroxytryptamine receptor 1A
Name:5-hydroxytryptamine receptor 1A
Type:n/a
Mol. Mass.:46122.49
Organism:Homo sapiens (Human)
Description:n/a
Residue:422
BDBM50267833
NameBDBM50267833
Synonyms:1-[3-(3,4-Dihydroisoquinolin-2(1H)-yl)propyl]-1,3-dihydro-2H-indol-2-one | CHEMBL455210
TypeSmall organic molecule
Emp. Form.C20H22N2O
Mol. Mass.306.4015
SMILESO=C1Cc2ccccc2N1CCCN1CCc2ccccc2C1