Reaction Details
TargetCannabinoid receptor 2
LigandBDBM50259138
Substrate/Competitorn/a
Meas. Tech.ChEMBL_500189 (CHEMBL980656)
IC50 1100±n/a nM
Citation Debenham, JSMadsen-Duggan, CBWang, JTong, XLao, JFong, TMSchaeffer, MTXiao, JCHuang, CCShen, CPSloan Stribling, DShearman, LPStrack, AMEuan Macintyre, DHale, JJWalsh, TF Pyridopyrimidine based cannabinoid-1 receptor inverse agonists: Synthesis and biological evaluation. Bioorg Med Chem Lett19:2591-4 (2009) 
 
Cannabinoid receptor 2
Name:Cannabinoid receptor 2
Type:G Protein-Coupled Receptor (GPCR)
Mol. Mass.:39690.94
Organism:Homo sapiens (Human)
Description:P34972
Residue:360
BDBM50259138
NameBDBM50259138
Synonyms:7-(2-chlorophenyl)-6-(4-chlorophenyl)-2-methylpyrido[2,3-d]pyrimidin-4-amine | CHEMBL512410
TypeSmall organic molecule
Emp. Form.C20H14Cl2N4
Mol. Mass.381.258
SMILESCc1nc(N)c2cc(-c3ccc(Cl)cc3)c(nc2n1)-c1ccccc1Cl