Reaction Details
TargetCannabinoid receptor 1
LigandBDBM50259181
Substrate/Competitorn/a
Meas. Tech.ChEMBL_500188 (CHEMBL980655)
IC50 40±n/a nM
Citation Debenham, JSMadsen-Duggan, CBWang, JTong, XLao, JFong, TMSchaeffer, MTXiao, JCHuang, CCShen, CPSloan Stribling, DShearman, LPStrack, AMEuan Macintyre, DHale, JJWalsh, TF Pyridopyrimidine based cannabinoid-1 receptor inverse agonists: Synthesis and biological evaluation. Bioorg Med Chem Lett19:2591-4 (2009) 
 
Cannabinoid receptor 1
Name:Cannabinoid receptor 1
Type:G Protein-Coupled Receptor (GPCR)
Mol. Mass.:52868.96
Organism:Homo sapiens (Human)
Description:P21554
Residue:472
BDBM50259181
NameBDBM50259181
Synonyms:2-tert-butyl-7-(2-chlorophenyl)-6-(4-chlorophenyl)pyrido[2,3-d]pyrimidin-4-amine | CHEMBL466681
TypeSmall organic molecule
Emp. Form.C23H20Cl2N4
Mol. Mass.423.338
SMILESCC(C)(C)c1nc(N)c2cc(-c3ccc(Cl)cc3)c(nc2n1)-c1ccccc1Cl