Reaction Details
TargetCannabinoid receptor 1
LigandBDBM50259182
Substrate/Competitorn/a
Meas. Tech.ChEMBL_500188 (CHEMBL980655)
IC50 11±n/a nM
Citation Debenham, JSMadsen-Duggan, CBWang, JTong, XLao, JFong, TMSchaeffer, MTXiao, JCHuang, CCShen, CPSloan Stribling, DShearman, LPStrack, AMEuan Macintyre, DHale, JJWalsh, TF Pyridopyrimidine based cannabinoid-1 receptor inverse agonists: Synthesis and biological evaluation. Bioorg Med Chem Lett19:2591-4 (2009) 
 
Cannabinoid receptor 1
Name:Cannabinoid receptor 1
Type:G Protein-Coupled Receptor (GPCR)
Mol. Mass.:52868.96
Organism:Homo sapiens (Human)
Description:P21554
Residue:472
BDBM50259182
NameBDBM50259182
Synonyms:2-tert-butyl-6-(4-chlorophenyl)-7-(2,4-dichlorophenyl)pyrido[2,3-d]pyrimidin-4-amine | CHEMBL466883
TypeSmall organic molecule
Emp. Form.C23H19Cl3N4
Mol. Mass.457.783
SMILESCC(C)(C)c1nc(N)c2cc(-c3ccc(Cl)cc3)c(nc2n1)-c1ccc(Cl)cc1Cl