Reaction Details
TargetCannabinoid receptor 2
LigandBDBM50259224
Substrate/Competitorn/a
Meas. Tech.ChEMBL_500189 (CHEMBL980656)
IC50 2700±n/a nM
Citation Debenham, JSMadsen-Duggan, CBWang, JTong, XLao, JFong, TMSchaeffer, MTXiao, JCHuang, CCShen, CPSloan Stribling, DShearman, LPStrack, AMEuan Macintyre, DHale, JJWalsh, TF Pyridopyrimidine based cannabinoid-1 receptor inverse agonists: Synthesis and biological evaluation. Bioorg Med Chem Lett19:2591-4 (2009) 
 
Cannabinoid receptor 2
Name:Cannabinoid receptor 2
Type:G Protein-Coupled Receptor (GPCR)
Mol. Mass.:39690.94
Organism:Homo sapiens (Human)
Description:P34972
Residue:360
BDBM50259224
NameBDBM50259224
Synonyms:2-tert-butyl-7-(2-chlorophenyl)-6-(4-chlorophenyl)-N,N-diethylpyrido[2,3-d]pyrimidin-4-amine | CHEMBL466686
TypeSmall organic molecule
Emp. Form.C27H28Cl2N4
Mol. Mass.479.444
SMILESCCN(CC)c1nc(nc2nc(-c3ccccc3Cl)c(cc12)-c1ccc(Cl)cc1)C(C)(C)C