Reaction Details
TargetCannabinoid receptor 1
LigandBDBM50259269
Substrate/Competitorn/a
Meas. Tech.ChEMBL_500188 (CHEMBL980655)
IC50 4.1±n/a nM
Citation Debenham, JSMadsen-Duggan, CBWang, JTong, XLao, JFong, TMSchaeffer, MTXiao, JCHuang, CCShen, CPSloan Stribling, DShearman, LPStrack, AMEuan Macintyre, DHale, JJWalsh, TF Pyridopyrimidine based cannabinoid-1 receptor inverse agonists: Synthesis and biological evaluation. Bioorg Med Chem Lett19:2591-4 (2009) 
 
Cannabinoid receptor 1
Name:Cannabinoid receptor 1
Type:G Protein-Coupled Receptor (GPCR)
Mol. Mass.:52868.96
Organism:Homo sapiens (Human)
Description:P21554
Residue:472
BDBM50259269
NameBDBM50259269
Synonyms:2-tert-butyl-7-(2-chlorophenyl)-6-(4-chlorophenyl)-N-isopropylpyrido[2,3-d]pyrimidin-4-amine | CHEMBL511774
TypeSmall organic molecule
Emp. Form.C26H26Cl2N4
Mol. Mass.465.417
SMILESCC(C)Nc1nc(nc2nc(-c3ccccc3Cl)c(cc12)-c1ccc(Cl)cc1)C(C)(C)C