Reaction Details
TargetCannabinoid receptor 1
LigandBDBM50259270
Substrate/Competitorn/a
Meas. Tech.ChEMBL_500188 (CHEMBL980655)
IC50 150±n/a nM
Citation Debenham, JSMadsen-Duggan, CBWang, JTong, XLao, JFong, TMSchaeffer, MTXiao, JCHuang, CCShen, CPSloan Stribling, DShearman, LPStrack, AMEuan Macintyre, DHale, JJWalsh, TF Pyridopyrimidine based cannabinoid-1 receptor inverse agonists: Synthesis and biological evaluation. Bioorg Med Chem Lett19:2591-4 (2009) 
 
Cannabinoid receptor 1
Name:Cannabinoid receptor 1
Type:G Protein-Coupled Receptor (GPCR)
Mol. Mass.:52868.96
Organism:Homo sapiens (Human)
Description:P21554
Residue:472
BDBM50259270
NameBDBM50259270
Synonyms:7-(2-chlorophenyl)-6-(4-chlorophenyl)-N,N-diethyl-4-(isopropylamino)pyrido[2,3-d]pyrimidine-2-carboxamide | CHEMBL466084
TypeSmall organic molecule
Emp. Form.C27H27Cl2N5O
Mol. Mass.508.442
SMILESCCN(CC)C(=O)c1nc(NC(C)C)c2cc(-c3ccc(Cl)cc3)c(nc2n1)-c1ccccc1Cl