Reaction Details
TargetCannabinoid receptor 1
LigandBDBM50259271
Substrate/Competitorn/a
Meas. Tech.ChEMBL_500188 (CHEMBL980655)
IC50 7.5±n/a nM
Citation Debenham, JSMadsen-Duggan, CBWang, JTong, XLao, JFong, TMSchaeffer, MTXiao, JCHuang, CCShen, CPSloan Stribling, DShearman, LPStrack, AMEuan Macintyre, DHale, JJWalsh, TF Pyridopyrimidine based cannabinoid-1 receptor inverse agonists: Synthesis and biological evaluation. Bioorg Med Chem Lett19:2591-4 (2009) 
 
Cannabinoid receptor 1
Name:Cannabinoid receptor 1
Type:G Protein-Coupled Receptor (GPCR)
Mol. Mass.:52868.96
Organism:Homo sapiens (Human)
Description:P21554
Residue:472
BDBM50259271
NameBDBM50259271
Synonyms:2-tert-butyl-7-(2-chlorophenyl)-6-(4-chlorophenyl)-4-methoxypyrido[2,3-d]pyrimidine | CHEMBL513121
TypeSmall organic molecule
Emp. Form.C24H21Cl2N3O
Mol. Mass.438.349
SMILESCOc1nc(nc2nc(-c3ccccc3Cl)c(cc12)-c1ccc(Cl)cc1)C(C)(C)C