Reaction Details
TargetCannabinoid receptor 1
LigandBDBM50259337
Substrate/Competitorn/a
Meas. Tech.ChEMBL_500188 (CHEMBL980655)
IC50 1.1±n/a nM
Citation Debenham, JSMadsen-Duggan, CBWang, JTong, XLao, JFong, TMSchaeffer, MTXiao, JCHuang, CCShen, CPSloan Stribling, DShearman, LPStrack, AMEuan Macintyre, DHale, JJWalsh, TF Pyridopyrimidine based cannabinoid-1 receptor inverse agonists: Synthesis and biological evaluation. Bioorg Med Chem Lett19:2591-4 (2009) 
 
Cannabinoid receptor 1
Name:Cannabinoid receptor 1
Type:G Protein-Coupled Receptor (GPCR)
Mol. Mass.:52868.96
Organism:Homo sapiens (Human)
Description:P21554
Residue:472
BDBM50259337
NameBDBM50259337
Synonyms:3-((7-(2-chlorophenyl)-6-(4-chlorophenyl)-2-isopropylpyrido[2,3-d]pyrimidin-4-yloxy)methyl)-1,2,4-oxadiazole | CHEMBL466110
TypeSmall organic molecule
Emp. Form.C25H19Cl2N5O2
Mol. Mass.492.357
SMILESCC(C)c1nc(OCc2ncon2)c2cc(-c3ccc(Cl)cc3)c(nc2n1)-c1ccccc1Cl