Reaction Details
TargetCannabinoid receptor 1
LigandBDBM50259491
Substrate/Competitorn/a
Meas. Tech.ChEMBL_500188 (CHEMBL980655)
IC50 3±n/a nM
Citation Debenham, JSMadsen-Duggan, CBWang, JTong, XLao, JFong, TMSchaeffer, MTXiao, JCHuang, CCShen, CPSloan Stribling, DShearman, LPStrack, AMEuan Macintyre, DHale, JJWalsh, TF Pyridopyrimidine based cannabinoid-1 receptor inverse agonists: Synthesis and biological evaluation. Bioorg Med Chem Lett19:2591-4 (2009) 
 
Cannabinoid receptor 1
Name:Cannabinoid receptor 1
Type:G Protein-Coupled Receptor (GPCR)
Mol. Mass.:52868.96
Organism:Homo sapiens (Human)
Description:P21554
Residue:472
BDBM50259491
NameBDBM50259491
Synonyms:5-tert-butyl-8-(2-chlorophenyl)-9-(4-methoxyphenyl)pyrido[3,2-e][1,2,4]triazolo[4,3-c]pyrimidin-3(2H)-one | CHEMBL467701
TypeSmall organic molecule
Emp. Form.C25H22ClN5O2
Mol. Mass.459.927
SMILESCOc1ccc(cc1)-c1cc2c3n[nH]c(=O)n3c(nc2nc1-c1ccccc1Cl)C(C)(C)C