Reaction Details
TargetCollagenase 3
LigandBDBM50259009
Substrate/Competitorn/a
Meas. Tech.ChEMBL_500227 (CHEMBL980694)
IC50 2.2±n/a nM
Citation Hopper, DWVera, MDHow, DSabatini, JXiang, JSIpek, MThomason, JHu, YFeyfant, EWang, QGeorgiadis, KEReifenberg, ESheldon, RTKeohan, CCMajumdar, MKMorris, EASkotnicki, JSum, PE Synthesis and biological evaluation of ((4-keto)-phenoxy)methyl biphenyl-4-sulfonamides: a class of potent aggrecanase-1 inhibitors. Bioorg Med Chem Lett19:2487-91 (2009) 
 
Collagenase 3
Name:Collagenase 3
Type:Enzyme
Mol. Mass.:53808.06
Organism:Homo sapiens (Human)
Description:P45452
Residue:471
BDBM50259009
NameBDBM50259009
Synonyms:(R)-3-methyl-2-(4'-((5-oxo-5,6,7,8-tetrahydronaphthalen-2-yloxy)methyl)biphenyl-4-ylsulfonamido)butanoic acid | CHEMBL466118
TypeSmall organic molecule
Emp. Form.C28H29NO6S
Mol. Mass.507.598
SMILESCC(C)[C@@H](NS(=O)(=O)c1ccc(cc1)-c1ccc(COc2ccc3C(=O)CCCc3c2)cc1)C(O)=O