Reaction Details
TargetDual specificity calcium/calmodulin-dependent 3',5'-cyclic nucleotide phosphodiesterase 1B
LigandBDBM50259057
Substrate/Competitorn/a
Meas. Tech.ChEMBL_500709 (CHEMBL966925)
IC50 4950±n/a nM
Citation Deninno, MPAndrews, MBell, ASChen, YEller-Zarbo, CEshelby, NEtienne, JBMoore, DEPalmer, MJVisser, MSYu, LJZavadoski, WJMichael Gibbs, E The discovery of potent, selective, and orally bioavailable PDE9 inhibitors as potential hypoglycemic agents. Bioorg Med Chem Lett19:2537-41 (2009) 
 
Dual specificity calcium/calmodulin-dependent 3',5'-cyclic nucleotide phosphodiesterase 1B
Name:Dual specificity calcium/calmodulin-dependent 3',5'-cyclic nucleotide phosphodiesterase 1B
Type:Enzyme
Mol. Mass.:61366.51
Organism:Homo sapiens (Human)
Description:n/a
Residue:536
BDBM50259057
NameBDBM50259057
Synonyms:3-isopropyl-5-(2-(2-morpholinoethoxy)benzyl)-1H-pyrazolo[4,3-d]pyrimidin-7(6H)-one | CHEMBL466068
TypeSmall organic molecule
Emp. Form.C21H27N5O3
Mol. Mass.397.4708
SMILESCC(C)c1[nH]nc2c1nc(Cc1ccccc1OCCN1CCOCC1)[nH]c2=O