Reaction Details
TargetDual specificity calcium/calmodulin-dependent 3',5'-cyclic nucleotide phosphodiesterase 1C
LigandBDBM50259015
Substrate/Competitorn/a
Meas. Tech.ChEMBL_500710 (CHEMBL966926)
IC50 4±n/a nM
Citation Deninno, MPAndrews, MBell, ASChen, YEller-Zarbo, CEshelby, NEtienne, JBMoore, DEPalmer, MJVisser, MSYu, LJZavadoski, WJMichael Gibbs, E The discovery of potent, selective, and orally bioavailable PDE9 inhibitors as potential hypoglycemic agents. Bioorg Med Chem Lett19:2537-41 (2009) 
 
Dual specificity calcium/calmodulin-dependent 3',5'-cyclic nucleotide phosphodiesterase 1C
Name:Dual specificity calcium/calmodulin-dependent 3',5'-cyclic nucleotide phosphodiesterase 1C
Type:Enzyme
Mol. Mass.:80778.58
Organism:Homo sapiens (Human)
Description:Q14123
Residue:709
BDBM50259015
NameBDBM50259015
Synonyms:5-(3-chlorobenzyl)-3-isopropyl-1H-pyrazolo[4,3-d]pyrimidin-7(6H)-one | CHEMBL512790
TypeSmall organic molecule
Emp. Form.C15H15ClN4O
Mol. Mass.302.759
SMILESCC(C)c1[nH]nc2c1nc(Cc1cccc(Cl)c1)[nH]c2=O