Reaction Details
TargetcGMP-inhibited 3',5'-cyclic phosphodiesterase 3B
LigandBDBM50259148
Substrate/Competitorn/a
Meas. Tech.ChEMBL_500733 (CHEMBL970512)
IC50>1000±n/a nM
Citation Deninno, MPAndrews, MBell, ASChen, YEller-Zarbo, CEshelby, NEtienne, JBMoore, DEPalmer, MJVisser, MSYu, LJZavadoski, WJMichael Gibbs, E The discovery of potent, selective, and orally bioavailable PDE9 inhibitors as potential hypoglycemic agents. Bioorg Med Chem Lett19:2537-41 (2009) 
 
cGMP-inhibited 3',5'-cyclic phosphodiesterase 3B
Name:cGMP-inhibited 3',5'-cyclic phosphodiesterase 3B
Type:Enzyme
Mol. Mass.:124318.95
Organism:Homo sapiens (Human)
Description:PDE3B was generated from the full-length recombinant human clone transfected into Sf9 cells.
Residue:1112
BDBM50259148
NameBDBM50259148
Synonyms:(-)2-({(trans)-2-[(3-isopropyl-7-oxo-6,7-dihydro-1H-pyrazolo[4,3-d]pyrimidin-5-yl)methyl]cyclohexyl}amino)-4-(trifluoromethyl)pyrimidine-5-carboxylic acid | CHEMBL466280
TypeSmall organic molecule
Emp. Form.C21H24F3N7O3
Mol. Mass.479.4556
SMILESCC(C)c1[nH]nc2c1nc(C[C@@H]1CCCC[C@H]1Nc1ncc(C(O)=O)c(n1)C(F)(F)F)[nH]c2=O