Reaction Details
TargetcAMP-specific 3',5'-cyclic phosphodiesterase 4C
LigandBDBM50259057
Substrate/Competitorn/a
Meas. Tech.ChEMBL_500735 (CHEMBL970514)
IC50>10000±n/a nM
Citation Deninno, MPAndrews, MBell, ASChen, YEller-Zarbo, CEshelby, NEtienne, JBMoore, DEPalmer, MJVisser, MSYu, LJZavadoski, WJMichael Gibbs, E The discovery of potent, selective, and orally bioavailable PDE9 inhibitors as potential hypoglycemic agents. Bioorg Med Chem Lett19:2537-41 (2009) 
 
cAMP-specific 3',5'-cyclic phosphodiesterase 4C
Name:cAMP-specific 3',5'-cyclic phosphodiesterase 4C
Type:Enzyme Catalytic Domain
Mol. Mass.:79875.54
Organism:Homo sapiens (Human)
Description:Q08493
Residue:712
BDBM50259057
NameBDBM50259057
Synonyms:3-isopropyl-5-(2-(2-morpholinoethoxy)benzyl)-1H-pyrazolo[4,3-d]pyrimidin-7(6H)-one | CHEMBL466068
TypeSmall organic molecule
Emp. Form.C21H27N5O3
Mol. Mass.397.4708
SMILESCC(C)c1[nH]nc2c1nc(Cc1ccccc1OCCN1CCOCC1)[nH]c2=O