Reaction Details
TargetCasein kinase II subunit alpha
LigandBDBM7458
Substrate/Competitorn/a
Meas. Tech.ChEMBL_500824 (CHEMBL974405)
IC50 800±n/a nM
Citation Sekiguchi, YNakaniwa, TKinoshita, TNakanishi, IKitaura, KHirasawa, ATsujimoto, GTada, T Structural insight into human CK2alpha in complex with the potent inhibitor ellagic acid. Bioorg Med Chem Lett19:2920-3 (2009) 
 
Casein kinase II subunit alpha
Name:Casein kinase II subunit alpha
Type:Enzyme
Mol. Mass.:45151.12
Organism:Homo sapiens (Human)
Description:P68400
Residue:391
BDBM7458
NameBDBM7458
Synonyms:5,7-dihydroxy-2-(4-hydroxyphenyl)-4H-chromen-4-one Apigenin Apigenin (3) Apigenin, 13 Naringenin, 18 US11337935, Compound Apigenin cid_5280443 | jm5b01461, Compound 90
TypeSmall organic molecule
Emp. Form.C15H10O5
Mol. Mass.270.2369
SMILESOc1ccc(cc1)-c1cc(=O)c2c(O)cc(O)cc2o1