Reaction Details
Target5-hydroxytryptamine receptor 3A
LigandBDBM50081973
Substrate/Competitorn/a
Meas. Tech.ChEMBL_523626 (CHEMBL997997)
Ki 0.7±n/a nM
Citation Morelli, EGemma, SBudriesi, RCampiani, GNovellino, EFattorusso, CCatalanotti, BCoccone, SSRos, SBorrelli, GPersico, MFiorini, INacci, VIoan, PChiarini, AHamon, MCagnotto, AMennini, TFracasso, CColovic, MCaccia, SButini, S Specific targeting of peripheral serotonin 5-HT(3) receptors. Synthesis, biological investigation, and structure-activity relationships. J Med Chem52:3548-62 (2009) 
 
5-hydroxytryptamine receptor 3A
Name:5-hydroxytryptamine receptor 3A
Type:Enzyme Catalytic Domain
Mol. Mass.:55428.70
Organism:RAT
Description:5-HT3 HTR3A RAT::P35563
Residue:483
BDBM50081973
NameBDBM50081973
Synonyms:4-(4-Methyl-piperazin-1-yl)-pyrrolo[1,2-a]quinoxalin-7-ol CHEMBL139327
TypeSmall organic molecule
Emp. Form.C16H18N4O
Mol. Mass.282.3403
SMILESCN1CCN(CC1)c1nc2cc(O)ccc2n2cccc12