Reaction Details
TargetAndrogen receptor
LigandBDBM18524
Substrate/Competitorn/a
Meas. Tech.ChEMBL_523646 (CHEMBL998017)
Ki 1.5±n/a nM
Citation Mohler, MLBohl, CEJones, ACoss, CCNarayanan, RHe, YHwang, DJDalton, JTMiller, DD Nonsteroidal selective androgen receptor modulators (SARMs): dissociating the anabolic and androgenic activities of the androgen receptor for therapeutic benefit. J Med Chem52:3597-617 (2009) 
 
Androgen receptor
Name:Androgen receptor
Type:Receptor
Mol. Mass.:99185.27
Organism:Homo sapiens (Human)
Description:CHO cells were stably transfected with human AR gene.
Residue:920
BDBM18524
NameBDBM18524
Synonyms:6-[bis(2,2,2-trifluoroethyl)amino]-4-(trifluoromethyl)-1,2-dihydroquinolin-2-one LGD2226
TypeSmall organic molecule
Emp. Form.C14H9F9N2O
Mol. Mass.392.2197
SMILESFC(F)(F)CN(CC(F)(F)F)c1ccc2[nH]c(=O)cc(c2c1)C(F)(F)F