Reaction Details
TargetNeuropeptide Y receptor type 1
LigandBDBM50249758
Substrate/Competitorn/a
Meas. Tech.ChEMBL_498784 (CHEMBL1022823)
IC50>10000±n/a nM
Citation Sato, NAndo, MIshikawa, SJitsuoka, MNagai, KTakahashi, HSakuraba, ATsuge, HKitazawa, HIwaasa, HMashiko, SGomori, AMoriya, RFujino, NOhe, TIshihara, AKanatani, AFukami, T Discovery of tetrasubstituted imidazolines as potent and selective neuropeptide Y Y5 receptor antagonists: reduced human ether-a-go-go related gene potassium channel binding affinity and potent antiobesity effect. J Med Chem52:3385-96 (2009) 
 
Neuropeptide Y receptor type 1
Name:Neuropeptide Y receptor type 1
Type:Enzyme Catalytic Domain
Mol. Mass.:44399.07
Organism:Homo sapiens (Human)
Description:NPY-Y1 NPY1R HUMAN::P25929
Residue:384
BDBM50249758
NameBDBM50249758
Synonyms:2-[(4S,5S)-4-(4-Fluorophenyl)-4-(6-fluoro-3-pyridyl)-5-methyl-4,5-dihydro-1H-imidazol-2-yl]-4-pyridinecarbonitrile | CHEMBL491288
TypeSmall organic molecule
Emp. Form.C21H15F2N5
Mol. Mass.375.3741
SMILESC[C@@H]1NC(=N[C@@]1(c1ccc(F)cc1)c1ccc(F)nc1)c1cc(ccn1)C#N