Reaction Details
TargetMotilin receptor
LigandBDBM50268430
Substrate/Competitorn/a
Meas. Tech.ChEMBL_523907 (CHEMBL1001500)
IC50 1.1±n/a nM
Citation Taka, NMatsuoka, HSato, TYoshino, HImaoka, ISato, HKotake, KKumagai, YKamei, KOzaki, KHigashida, AKuroki, T Discovery of novel motilin antagonists: Conversion of tetrapeptide leads to orally available peptidomimetics. Bioorg Med Chem Lett19:3426-9 (2009) 
 
Motilin receptor
Name:Motilin receptor
Synonyms:n/a
Type:n/a
Mol. Mass.:43771.25
Organism:Oryctolagus cuniculus
Description:n/a
Residue:400
BDBM50268430
NameBDBM50268430
TypeSmall organic molecule
Emp. Form.C28H40N4O4
Mol. Mass.496.6416
SMILESCC(C)[C@H](N(C)C(=O)[C@@H](N)Cc1ccccc1)C(=O)N[C@@H](Cc1ccc(O)c(c1)C(C)(C)C)C(N)=O