Reaction Details
TargetCarboxypeptidase A1
LigandBDBM50109593
Substrate/Competitorn/a
Meas. Tech.ChEBML_45616
Ki 11±n/a nM
Citation Kim, DHShin, YSKim, KB The structural feature of S1′ subsite of carboxypeptidase A Bioorg Med Chem Lett1:317-322 (1991)    Article
 
Carboxypeptidase A1
Name:Carboxypeptidase A1
Type:Enzyme
Mol. Mass.:47073.90
Organism:Bos taurus (bovine)
Description:From Sigma-Aldrich Co.
Residue:419
BDBM50109593
NameBDBM50109593
Synonyms:2-Benzyl-3-mercapto-propionic acid CHEMBL58957 | SQ-14603
TypeSmall organic molecule
Emp. Form.C10H12O2S
Mol. Mass.196.266
SMILESOC(=O)C(CS)Cc1ccccc1