Reaction Details
TargetCarboxypeptidase A1
LigandBDBM50279956
Substrate/Competitorn/a
Meas. Tech.ChEBML_45616
Ki 120±n/a nM
Citation Kim, DHShin, YSKim, KB The structural feature of S1′ subsite of carboxypeptidase A Bioorg Med Chem Lett1:317-322 (1991)    Article
 
Carboxypeptidase A1
Name:Carboxypeptidase A1
Type:Enzyme
Mol. Mass.:47073.90
Organism:Bos taurus (bovine)
Description:From Sigma-Aldrich Co.
Residue:419
BDBM50279956
NameBDBM50279956
Synonyms:2-Mercaptomethyl-3-o-tolyl-propionic acid | CHEMBL325984
TypeSmall organic molecule
Emp. Form.C11H14O2S
Mol. Mass.210.293
SMILESCc1ccccc1CC(CS)C(O)=O