Reaction Details
TargetEpidermal growth factor receptor
LigandBDBM4301
Substrate/Competitorn/a
Meas. Tech.ChEBML_66907
IC50 20000±n/a nM
Citation BurkeJr., TRFord, HOsherov, NLevitzki, AStefanova, IHorak, IDMarquez, VE Arylamides of hydroxylated isoquinolines as protein-tyrosine kinase inhibitors Bioorg Med Chem Lett2:1771-1774 (1992)    Article
 
Epidermal growth factor receptor
Name:Epidermal growth factor receptor
Type:Receptor Kinase Domain
Mol. Mass.:134279.59
Organism:Homo sapiens (Human)
Description:P00533
Residue:1210
BDBM4301
NameBDBM4301
Synonyms:(2E)-2-cyano-3-(3,4-dihydroxyphenyl)prop-2-enamide Tyrphostin deriv. 40 | benzylidenemalononitrile (BMN) deriv. 46
TypeSmall organic molecule
Emp. Form.C10H8N2O3
Mol. Mass.204.1821
SMILESNC(=O)C(=C\c1ccc(O)c(O)c1)\C#N