Reaction Details
TargetCarboxylic ester hydrolase
LigandBDBM50280625
Substrate/Competitorn/a
Meas. Tech.ChEBML_41589
IC50 22±n/a nM
Citation Gregor, VEEmmerling, MRLee, CMoore, CJ The synthesis and in vitro acetylcholinesterase and butyrylcholinesterase inhibitory activity of tacrine (Cognex®) derivaties Bioorg Med Chem Lett2:861-864 (1992)    Article
 
Carboxylic ester hydrolase
Name:Carboxylic ester hydrolase
Type:Protein
Mol. Mass.:68842.83
Organism:Equus caballus (Horse)
Description:Q9N1N9
Residue:602
BDBM50280625
NameBDBM50280625
Synonyms:7-chloro-10-azatetracyclo[10.2.1.02,11.04,9]pentadeca-2,4,6,8,10-pentaen-3-amine CHEMBL352500
TypeSmall organic molecule
Emp. Form.C14H13ClN2
Mol. Mass.244.719
SMILESNc1c2C3CCC(C3)c2nc2cc(Cl)ccc12