Reaction Details
TargetAcetylcholinesterase
LigandBDBM50280624
Substrate/Competitorn/a
Meas. Tech.ChEBML_27996
IC50 78±n/a nM
Citation Gregor, VEEmmerling, MRLee, CMoore, CJ The synthesis and in vitro acetylcholinesterase and butyrylcholinesterase inhibitory activity of tacrine (Cognex®) derivaties Bioorg Med Chem Lett2:861-864 (1992)    Article
 
Acetylcholinesterase
Name:Acetylcholinesterase
Type:Enzyme
Mol. Mass.:71812.79
Organism:Electrophorus electricus (Electric eel)
Description:n/a
Residue:633
BDBM50280624
NameBDBM50280624
Synonyms:6-chloro-10-azatetracyclo[10.2.1.02,11.04,9]pentadeca-2,4,6,8,10-pentaen-3-amine CHEMBL172118
TypeSmall organic molecule
Emp. Form.C14H13ClN2
Mol. Mass.244.719
SMILESNc1c2C3CCC(C3)c2nc2ccc(Cl)cc12