Reaction Details
TargetAcetylcholinesterase
LigandBDBM50280623
Substrate/Competitorn/a
Meas. Tech.ChEBML_27996
IC50 36±n/a nM
Citation Gregor, VEEmmerling, MRLee, CMoore, CJ The synthesis and in vitro acetylcholinesterase and butyrylcholinesterase inhibitory activity of tacrine (Cognex®) derivaties Bioorg Med Chem Lett2:861-864 (1992)    Article
 
Acetylcholinesterase
Name:Acetylcholinesterase
Type:Enzyme
Mol. Mass.:71812.79
Organism:Electrophorus electricus (Electric eel)
Description:n/a
Residue:633
BDBM50280623
NameBDBM50280623
Synonyms:5-Chloro-1,2,3,4-tetrahydro-acridin-9-ylamine CHEMBL369661
TypeSmall organic molecule
Emp. Form.C13H13ClN2
Mol. Mass.232.709
SMILESNc1c2CCCCc2nc2c(Cl)cccc12