Reaction Details
TargetAcetylcholinesterase
LigandBDBM8986
Substrate/Competitorn/a
Meas. Tech.ChEBML_27996
IC50 40±n/a nM
Citation Gregor, VEEmmerling, MRLee, CMoore, CJ The synthesis and in vitro acetylcholinesterase and butyrylcholinesterase inhibitory activity of tacrine (Cognex®) derivaties Bioorg Med Chem Lett2:861-864 (1992)    Article
 
Acetylcholinesterase
Name:Acetylcholinesterase
Type:Enzyme
Mol. Mass.:71812.79
Organism:Electrophorus electricus (Electric eel)
Description:n/a
Residue:633
BDBM8986
NameBDBM8986
Synonyms:7-chloro-1,2,3,4-tetrahydroacridin-9-amine | Tacrine Analogue 3
TypeSmall organic molecule
Emp. Form.C13H13ClN2
Mol. Mass.232.709
SMILESNc1c2CCCCc2nc2ccc(Cl)cc12