Reaction Details
TargetCysteinyl leukotriene receptor 1
LigandBDBM50280698
Substrate/Competitorn/a
Meas. Tech.ChEMBL_99985 (CHEMBL710510)
IC50 0.600000±n/a nM
Citation Labelle, MPrasit, PBelley, MBlouin, MChampion, ECharette, LDeLuca, JGDufresne, CFrenette, RGauthier, JYGrimm, EGrossman, SJGuay, DHerold, EGJones, TRLau, CKLeblanc, YLéger, SLord, AMcAuliffe, M The discovery of a new structural class of potent orally active leukotriene D4 antagonists Bioorg Med Chem Lett2:1141-1146 (1992)    Article
 
Cysteinyl leukotriene receptor 1
Name:Cysteinyl leukotriene receptor 1
Type:Enzyme Catalytic Domain
Mol. Mass.:39007.58
Organism:GUINEA PIG
Description:Leukotriene D4 0 GUINEA PIG::Q2NNR5
Residue:340
BDBM50280698
NameBDBM50280698
Synonyms:CHEMBL274049 | Sodium; 3-[1-[3-(7-chloro-quinolin-2-ylmethoxy)-phenyl]-3-(2-methanesulfonylamino-phenyl)-propylsulfanyl]-propionate
TypeSmall organic molecule
Emp. Form.C29H28ClN2O5S2
Mol. Mass.584.127
SMILESCS(=O)(=O)Nc1ccccc1CCC(SCCC([O-])=O)c1cccc(OCc2ccc3ccc(Cl)cc3n2)c1