Reaction Details
TargetEndothelin receptor type B
LigandBDBM50280989
Substrate/Competitorn/a
Meas. Tech.ChEBML_64181
IC50 295±n/a nM
Citation Mugrage, BMoliterni, JRobinson, LWebb, RLShetty, SSLipson, KEChin, MHNeale, RCioffi, C CGS 27830, a potent nonpeptide endothelin receptor antagonist Bioorg Med Chem Lett3:2099-2104 (1993)    Article
 
Endothelin receptor type B
Name:Endothelin receptor type B
Type:Enzyme Catalytic Domain
Mol. Mass.:49483.43
Organism:RAT
Description:ENDOTHELIN B EDNRB RAT::P21451
Residue:442
BDBM50280989
NameBDBM50280989
Synonyms:2,6-dimethyl-5-methyloxycarbonyl-4-(3-nitrophenyl)-1,4-dihydro-3-pyridinecarboxylic anhydride CHEMBL67074
TypeSmall organic molecule
Emp. Form.C32H30N4O11
Mol. Mass.646.6008
SMILESCOC(=O)C1[C@@H](C(C(=O)OC(=[OH+])C2=C(C)N=C(C)C([C@H]2c2cccc(c2)[N+]([O-])=O)=C([O-])OC)=C(C)N=C1C)c1cccc(c1)[N+]([O-])=O