Reaction Details
TargetChymotrypsin-like elastase family member 2A
LigandBDBM50199883
Substrate/Competitorn/a
Meas. Tech.ChEMBL_194721 (CHEMBL807702)
IC50 700±n/a nM
Citation Adonias, MAnayaba, JCámara, JCanet, EGateau-Olesker, AGero, SDGrande, MHernando, JI Enantioselective synthesis and antielastase activity of 1,3,4-trisubstituted and 3,4-disubstituted β-lactam antibiotics Bioorg Med Chem Lett3:2547-2552 (1993)    Article
 
Chymotrypsin-like elastase family member 2A
Name:Chymotrypsin-like elastase family member 2A
Type:PROTEIN
Mol. Mass.:28894.94
Organism:Rattus norvegicus
Description:ChEMBL_194721
Residue:271
BDBM50199883
NameBDBM50199883
Synonyms:3,4‐Dichloroisocoumarin (2) 3,4-dichloro-1H-isochromen-1-one CHEMBL24983 | cid_1609
TypeSmall organic molecule
Emp. Form.C9H4Cl2O2
Mol. Mass.215.033
SMILESClc1oc(=O)c2ccccc2c1Cl