Reaction Details
TargetChymotrypsin-like elastase family member 2A
LigandBDBM50281094
Substrate/Competitorn/a
Meas. Tech.ChEBML_194721
IC50>200000±n/a nM
Citation Adonias, MAnayaba, JCámara, JCanet, EGateau-Olesker, AGero, SDGrande, MHernando, JI Enantioselective synthesis and antielastase activity of 1,3,4-trisubstituted and 3,4-disubstituted β-lactam antibiotics Bioorg Med Chem Lett3:2547-2552 (1993)    Article
 
Chymotrypsin-like elastase family member 2A
Name:Chymotrypsin-like elastase family member 2A
Type:PROTEIN
Mol. Mass.:28894.94
Organism:Rattus norvegicus
Description:ChEMBL_194721
Residue:271
BDBM50281094
NameBDBM50281094
Synonyms:(3R,4R)-3-Butyl-1-[(R)-[1,3]dithian-2-yl-(2,2,2',2'-tetramethyl-[4,4']bi[[1,3]dioxolanyl]-5-yl)-methyl]-4-((E)-1-methyl-2-phenyl-vinyl)-azetidin-2-one | CHEMBL82333
TypeSmall organic molecule
Emp. Form.C31H45NO5S2
Mol. Mass.575.823
SMILESCCCC[C@@H]1[C@@H](N([C@H](C2OC(C)(C)OC2C2COC(C)(C)O2)C2SCCCS2)C1=O)C(\C)=C\c1ccccc1