Reaction Details
TargetType-1 angiotensin II receptor
LigandBDBM50009714
Substrate/Competitorn/a
Meas. Tech.ChEBML_36774
IC50 425±n/a nM
Citation Murray, WVLalan, PGill, AAddo, MFLewis, JMLee, DKWachter, MPRampulla, RUnderwood, DC Substituted pyrrolidin-2-one biphenyltetrazoles as angiotensin II antagonists Bioorg Med Chem Lett3:369-374 (1993)    Article
 
Type-1 angiotensin II receptor
Name:Type-1 angiotensin II receptor
Type:PROTEIN
Mol. Mass.:41107.81
Organism:Bos taurus
Description:ChEMBL_36779
Residue:359
BDBM50009714
NameBDBM50009714
Synonyms:CHEMBL191 | {2-Butyl-5-chloro-3-[2'-(2H-tetrazol-5-yl)-biphenyl-4-ylmethyl]-4,5-dihydro-3H-imidazol-4-yl}-methanol(DuP 753)
TypeSmall organic molecule
Emp. Form.C22H25ClN6O
Mol. Mass.424.927
SMILESCCCCC1=NC(Cl)C(CO)N1Cc1ccc(cc1)-c1ccccc1-c1nnn[nH]1