Reaction Details
TargetGag-Pol polyprotein [489-587]
LigandBDBM50281569
Substrate/Competitorn/a
Meas. Tech.ChEBML_162612
IC50 36±n/a nM
Citation Holmes, DSClemens, IRCobley, KNHumber, DCKitchin, JOrr, DCPatel, BPaternoster, ILStorer, R Novel dimeric penicillin derived inhibitors of HIV-1 proteinase: interaction with the catalytic aspartates Bioorg Med Chem Lett3:503-508 (1993)    Article
 
Gag-Pol polyprotein [489-587]
Name:Gag-Pol polyprotein [489-587]
Type:Enzyme Subunit
Mol. Mass.:10781.16
Organism:Human immunodeficiency virus type 1
Description:P04585[489-587]
Residue:99
BDBM50281569
NameBDBM50281569
Synonyms:1N-benzyl-2-[4-[4-[2-benzylcarbamoyl(benzylcarboxamido)methyl-5,5-dimethyl-(2S,4S)-1,3-thiazolan-4-ylcarboxamido]-2,3-dihydroxy-(2S,3S)-butylcarbamoyl]-5,5-dimethyl-(2R,4S)-1,3-thiazolan-2-yl]-2-benzylcarboxamidoacetamide | CHEMBL408108
TypeSmall organic molecule
Emp. Form.C50H62N8O8S2
Mol. Mass.967.206
SMILESCC1(C)S[C@@H](N[C@H]1C(=O)NC[C@H](O)[C@@H](O)CNC(=O)[C@@H]1N[C@H](SC1(C)C)[C@H](NC(=O)Cc1ccccc1)C(=O)NCc1ccccc1)[C@H](NC(=O)Cc1ccccc1)C(=O)NCc1ccccc1