Reaction Details
TargetProtein kinase C epsilon type
LigandBDBM50282632
Substrate/Competitorn/a
Meas. Tech.ChEMBL_160964 (CHEMBL769125)
IC50 48±n/a nM
Citation Davis, PDHallam, TJHarris, WHill, CHLawton, GNixon, JSSmith, JLVesey, DRWilkinson, SE Bisindolylmaleimide inhibitors of protein kinase C. Further conformational restriction of a tertiary amine side chain. Bioorg Med Chem Lett4:1303-1308 (1994)    Article
 
Protein kinase C epsilon type
Name:Protein kinase C epsilon type
Type:PROTEIN
Mol. Mass.:83483.06
Organism:Rattus norvegicus
Description:ChEMBL_160964
Residue:737
BDBM50282632
NameBDBM50282632
Synonyms:3-((3aR,10aR)-2-Methyl-2,3,3a,4,10,10a-hexahydro-1H-2,4a-diaza-cyclopenta[b]fluoren-9-yl)-4-(1-methyl-1H-indol-3-yl)-pyrrole-2,5-dione; hydrochloride Ro-32-0557
TypeSmall organic molecule
Emp. Form.C28H26N4O2
Mol. Mass.450.5316
SMILESCN1C[C@@H]2Cc3c(C4=C(C(=O)NC4=O)c4cn(C)c5ccccc45)c4ccccc4n3C[C@H]2C1