Reaction Details
TargetMuscarinic acetylcholine receptor M1
LigandBDBM50003369
Substrate/Competitorn/a
Meas. Tech.ChEMBL_138805 (CHEMBL751540)
IC50 18±n/a nM
Citation Quimby, SJShannon, HEBymaster, FPSauerberg, POlesen, PHSheardown, MJSuzdak, PDMitch, CH Synthesis and structure activity relationships of alkyl substituted analogues of the functional M1 selective muscarinic receptor agonist xanomeline Bioorg Med Chem Lett4:2205-2210 (1994)    Article
 
Muscarinic acetylcholine receptor M1
Name:Muscarinic acetylcholine receptor M1
Type:Enzyme Catalytic Domain
Mol. Mass.:51390.46
Organism:RAT
Description:P08482
Residue:460
BDBM50003369
NameBDBM50003369
Synonyms:1-Methyl-5-(4-propoxy-[1,2,5]thiadiazol-3-yl)-1,2,3,6-tetrahydro-pyridine 1-methyl-5-(4-propoxy-1,2,5-thiadiazol-3-yl)-1,2,3,6-tetrahydropyridine CHEMBL308803
TypeSmall organic molecule
Emp. Form.C11H17N3OS
Mol. Mass.239.337
SMILESCCCOc1nsnc1C1=CCCN(C)C1