Reaction Details
TargetSubstance-P receptor
LigandBDBM50154572
Substrate/Competitorn/a
Meas. Tech.ChEMBL_142887 (CHEMBL747298)
IC50 0.850±n/a nM
Citation Mills, SGMacCoss, MUnderwood, DShah, SKFinke, PEMiller, DJBudhu, RJCascieri, MASadowski, SStrader, CD 1,2,3-Trisubstituted cyclohexyl substance P antagonists: significance of the ring nitrogen in piperidine-based NK-1 receptor antagonists Bioorg Med Chem Lett5:1345-1350 (1995)    Article
 
Substance-P receptor
Name:Substance-P receptor
Type:G Protein-Coupled Receptor (GPCR)
Mol. Mass.:46254.43
Organism:Homo sapiens (Human)
Description:P25103
Residue:407
BDBM50154572
NameBDBM50154572
Synonyms:1-Amino-2-[1-(3,5-bis-trifluoromethyl-benzyloxymethyl)-2,2-diphenyl-ethylamino]-ethanol CHEMBL28055
TypeSmall organic molecule
Emp. Form.C26H24F6N2O2
Mol. Mass.510.4714
SMILESNC(=O)CNC(COCc1cc(cc(c1)C(F)(F)F)C(F)(F)F)C(c1ccccc1)c1ccccc1