Reaction Details
TargetPolyunsaturated fatty acid 5-lipoxygenase
LigandBDBM50012434
Substrate/Competitorn/a
Meas. Tech.ChEMBL_3964 (CHEMBL618062)
IC50 150±n/a nM
Citation Andrews, EGAntognoli, GWBreslow, RCarta, MPCarty, TJChambers, RJCheng, JBCohan, VLCollins, JLDamon, DBDelehunt, JEggler, JFEskra, JDFreiert, KWHada, WAMarfat, AMasamune, HMelvin, LSMularski, CJNaclerio, BA Synthesis and pharmacological profile of two novel heterocyclic chromanols, CP-80,798 and CP-85,958, as potent LTD4 receptor antagonists Bioorg Med Chem Lett5:1365-1370 (1995)    Article
 
Polyunsaturated fatty acid 5-lipoxygenase
Name:Polyunsaturated fatty acid 5-lipoxygenase
Type:PROTEIN
Mol. Mass.:78082.31
Organism:Rattus norvegicus
Description:ChEMBL_1432947
Residue:673
BDBM50012434
NameBDBM50012434
Synonyms:(REV-5,901)1-[3-(Quinolin-2-ylmethoxy)-phenyl]-hexan-1-ol 1-[3-(Quinolin-2-ylmethoxy)-phenyl]-hexan-1-ol (RG 5901) CHEMBL8747 REV-901
TypeSmall organic molecule
Emp. Form.C22H25NO2
Mol. Mass.335.4394
SMILESCCCCCC(O)c1cccc(OCc2ccc3ccccc3n2)c1