Reaction Details
TargetAdenosine receptor A1
LigandBDBM50009073
Substrate/Competitorn/a
Meas. Tech.ChEBML_27485
IC50>10000±n/a nM
Citation Marfat, AChambers, RCheng, JCooper, KDamon, DDelehunt, JEggler, JMasamune, HMelvin, LWatson, J The discovery of CP-96,021 and CP-96,486, balanced, combined, potent and orally active leukotriene D4 (LTD4)/platelet activating factor (PAF) receptor antagonists. Bioorg Med Chem Lett5:1377-1382 (1995)    Article
 
Adenosine receptor A1
Name:Adenosine receptor A1
Type:G Protein-Coupled Receptor (GPCR)
Mol. Mass.:36520.92
Organism:Homo sapiens (Human)
Description:P30542
Residue:326
BDBM50009073
NameBDBM50009073
Synonyms:4-(5-cyclopentyloxycarbonylamino-1-methyl-1H-indol-3-ylmethyl)-3-methoxy-N-o-tolylsulfonylbenzamide ZAFIRLUKAST cyclopentyl 3-[2-methoxy-4-(2-methylphenylsulfonylcarbamoyl)benzyl]-1-methyl-1H-indol-5-ylcarbamate
TypeSmall organic molecule
Emp. Form.C31H33N3O6S
Mol. Mass.575.675
SMILESCOc1cc(ccc1Cc1cn(C)c2ccc(NC(=O)OC3CCCC3)cc12)C(=O)NS(=O)(=O)c1ccccc1C