Reaction Details
TargetMuscarinic acetylcholine receptor M1/M2/M3/M4/M5
LigandBDBM50009073
Substrate/Competitorn/a
Meas. Tech.ChEMBL_138341 (CHEMBL747771)
IC50>10000±n/a nM
Citation Marfat, AChambers, RCheng, JCooper, KDamon, DDelehunt, JEggler, JMasamune, HMelvin, LWatson, J The discovery of CP-96,021 and CP-96,486, balanced, combined, potent and orally active leukotriene D4 (LTD4)/platelet activating factor (PAF) receptor antagonists. Bioorg Med Chem Lett5:1377-1382 (1995)    Article
 
Muscarinic acetylcholine receptor M1/M2/M3/M4/M5
Name:Muscarinic acetylcholine receptor M1/M2/M3/M4/M5
Synonyms:Muscarinic acetylcholine receptor
Type:n/a
Mol. Mass.:n/a
Description:ASSAY_ID of ChEMBL is 329940
Components:This complex has 5 components.
Component 1
Name:Muscarinic acetylcholine receptor M2
Type:GPCR
Mol. Mass.:51730.61
Organism:Homo sapiens (Human)
Description:P08172
Residue:466
Component 2
Name:Muscarinic acetylcholine receptor M3
Synonyms:ACM3_HUMAN Cholinergic, muscarinic M3 Muscarinic receptor M3 | RecName: Full=Muscarinic acetylcholine receptor M3
Type:Enzyme
Mol. Mass.:66151.03
Organism:Homo sapiens (Human)
Description:P20309
Residue:590
Component 3
Name:Muscarinic acetylcholine receptor M5
Synonyms:ACM5_HUMAN | CHRM5
Type:PROTEIN
Mol. Mass.:60102.35
Organism:Homo sapiens (Human)
Description:ChEMBL_1517990
Residue:532
Component 4
Name:Muscarinic acetylcholine receptor M1
Synonyms:ACM1_HUMAN Cholinergic receptor, muscarinic 1 | Cholinergic, muscarinic M1
Type:Protein
Mol. Mass.:51442.54
Organism:Homo sapiens (Human)
Description:P11229
Residue:460
Component 5
Name:Muscarinic acetylcholine receptor M4
Synonyms:ACM4_HUMAN Cholinergic, muscarinic M4 Muscarinic acetylcholine receptor M2 and M4
Type:Enzyme Catalytic Domain
Mol. Mass.:53079.31
Organism:Homo sapiens (Human)
Description:Cholinergic, muscarinic M4 CHRM4 HUMAN M3::P08173
Residue:479
BDBM50009073
NameBDBM50009073
Synonyms:4-(5-cyclopentyloxycarbonylamino-1-methyl-1H-indol-3-ylmethyl)-3-methoxy-N-o-tolylsulfonylbenzamide ZAFIRLUKAST cyclopentyl 3-[2-methoxy-4-(2-methylphenylsulfonylcarbamoyl)benzyl]-1-methyl-1H-indol-5-ylcarbamate
TypeSmall organic molecule
Emp. Form.C31H33N3O6S
Mol. Mass.575.675
SMILESCOc1cc(ccc1Cc1cn(C)c2ccc(NC(=O)OC3CCCC3)cc12)C(=O)NS(=O)(=O)c1ccccc1C