Reaction Details
TargetCaspase-1
LigandBDBM50284734
Substrate/Competitorn/a
Meas. Tech.ChEMBL_90978 (CHEMBL696525)
Ki 500±n/a nM
Citation Mjalli, AMZhao, JJChapman, KTThornberry, NAPeterson, EPMacCoss, MHagmann, WK Inhibition of interleukin-1β converting enzyme by N-acyl-aspartyl aryloxymethyl ketones Bioorg Med Chem Lett5:1409-1414 (1995)    Article
 
Caspase-1
Name:Caspase-1
Type:Enzyme
Mol. Mass.:45154.13
Organism:Homo sapiens (Human)
Description:P29466
Residue:404
BDBM50284734
NameBDBM50284734
Synonyms:3-Allyloxycarbonylamino-4-oxo-5-(3-phenylcarbamoyl-naphthalen-2-yloxy)-pentanoic acid | CHEMBL281745
TypeSmall organic molecule
Emp. Form.C26H24N2O7
Mol. Mass.476.478
SMILESOC(=O)CC(NC(=O)OCC=C)C(=O)COc1cc2ccccc2cc1C(=O)Nc1ccccc1