Reaction Details
TargetCaspase-1
LigandBDBM50284743
Substrate/Competitorn/a
Meas. Tech.ChEBML_90989
Ki 2700±n/a nM
Citation Mjalli, AMZhao, JJChapman, KTThornberry, NAPeterson, EPMacCoss, MHagmann, WK Inhibition of interleukin-1β converting enzyme by N-acyl-aspartyl aryloxymethyl ketones Bioorg Med Chem Lett5:1409-1414 (1995)    Article
 
Caspase-1
Name:Caspase-1
Type:Enzyme
Mol. Mass.:45154.13
Organism:Homo sapiens (Human)
Description:P29466
Residue:404
BDBM50284743
NameBDBM50284743
Synonyms:3-Allyloxycarbonylamino-4-oxo-5-phenoxy-pentanoic acid | CHEMBL30360
TypeSmall organic molecule
Emp. Form.C15H17NO6
Mol. Mass.307.2986
SMILESOC(=O)CC(NC(=O)OCC=C)C(=O)COc1ccccc1