Reaction Details
TargetDelta-type opioid receptor
LigandBDBM50421363
Substrate/Competitorn/a
Meas. Tech.ChEBML_146725
IC50 5.3±n/a nM
Citation Bidlack, JMKaplan, RASebastian, ASeyed-Mozaffari, AHutchinson, IArcher, S N-Methyl and N-cyclopropylmethyl-14α,14′β-[dithiobis[(2-oxo-2,1-ethanediyl)imino]]bis(7,8-dihydro-5β-methyl-morphinone) MET-TAMO and N-CPM-MET-TAMO: Synthesis and opioid binding properties Bioorg Med Chem Lett5:1695-1700 (1995)    Article
 
Delta-type opioid receptor
Name:Delta-type opioid receptor
Type:G Protein-Coupled Receptor (GPCR)
Mol. Mass.:40382.98
Organism:Homo sapiens (Human)
Description:Competition binding assays were carried out using membrane preparations from transfected HN9.10 cells that constitutively expressed the delta opioid receptor.
Residue:372
BDBM50421363
NameBDBM50421363
Synonyms:CHEMBL2304424
TypeSmall organic molecule
Emp. Form.C46H54N4O8S2
Mol. Mass.855.073
SMILESC[C@@]12Oc3c4c(C[C@H]5N(CC6CC6)CC[C@@]14[C@]5(CCC2=O)NC(=O)CSSCC(=O)N[C@]12CCC(=O)[C@]4(C)Oc5c6c(C[C@H]1N(CC1CC1)CC[C@@]246)ccc5O)ccc3O