Reaction Details
TargetMu-type opioid receptor
LigandBDBM50030145
Substrate/Competitorn/a
Meas. Tech.ChEBML_146693
IC50 3.9±n/a nM
Citation Bidlack, JMKaplan, RASebastian, ASeyed-Mozaffari, AHutchinson, IArcher, S N-Methyl and N-cyclopropylmethyl-14α,14′β-[dithiobis[(2-oxo-2,1-ethanediyl)imino]]bis(7,8-dihydro-5β-methyl-morphinone) MET-TAMO and N-CPM-MET-TAMO: Synthesis and opioid binding properties Bioorg Med Chem Lett5:1695-1700 (1995)    Article
 
Mu-type opioid receptor
Name:Mu-type opioid receptor
Type:Enzyme Catalytic Domain
Mol. Mass.:45038.37
Organism:CALF
Description:OPIATE Mu 2 0 CALF::P79350
Residue:401
BDBM50030145
NameBDBM50030145
Synonyms:CHEMBL290701 | bis-(1N-[4-cyclopropylmethyl-10-hydroxy-14-oxo-12-oxa-4-azapentacyclo[9.6.1.01,13.05,17.07,18]octadeca-7,9,11(18)-trien-17-yl]-2-sulfanylacetamide)
TypeSmall organic molecule
Emp. Form.C44H50N4O8S2
Mol. Mass.827.02
SMILESOc1ccc2C[C@H]3N(CC4CC4)CC[C@@]45[C@@H](Oc1c24)C(=O)CC[C@@]35NC(=O)CSSCC(=O)N[C@]12CCC(=O)[C@@H]3Oc4c5c(C[C@H]1N(CC1CC1)CC[C@@]235)ccc4O