Reaction Details
TargetDelta-type opioid receptor
LigandBDBM50284914
Substrate/Competitorn/a
Meas. Tech.ChEBML_146725
IC50 52±n/a nM
Citation Bidlack, JMKaplan, RASebastian, ASeyed-Mozaffari, AHutchinson, IArcher, S N-Methyl and N-cyclopropylmethyl-14α,14′β-[dithiobis[(2-oxo-2,1-ethanediyl)imino]]bis(7,8-dihydro-5β-methyl-morphinone) MET-TAMO and N-CPM-MET-TAMO: Synthesis and opioid binding properties Bioorg Med Chem Lett5:1695-1700 (1995)    Article
 
Delta-type opioid receptor
Name:Delta-type opioid receptor
Type:G Protein-Coupled Receptor (GPCR)
Mol. Mass.:40382.98
Organism:Homo sapiens (Human)
Description:Competition binding assays were carried out using membrane preparations from transfected HN9.10 cells that constitutively expressed the delta opioid receptor.
Residue:372
BDBM50284914
NameBDBM50284914
Synonyms:CHEMBL297605 | MET-TAMO and N-CPM-MET-TAMO analogue
TypeSmall organic molecule
Emp. Form.C40H46N4O8S2
Mol. Mass.774.945
SMILESCN1CC[C@]23c4c5O[C@@]2(C)C(=O)CC[C@@]3(NC(=O)CSSCC(=O)N[C@]23CCC(=O)[C@]6(C)Oc7c8c(CC2N(C)CC[C@@]368)ccc7O)C1Cc4ccc5O