Reaction Details
TargetGag-Pol polyprotein [489-587]
LigandBDBM914
Substrate/Competitorn/a
Meas. Tech.ChEMBL_157712 (CHEMBL763386)
Ki 100±n/a nM
Citation Ahmad, SAshfaq, AAlam, MBisacchi, GSChen, PCheng, PTGreytok, JAHermsmeier, MALin, PFLis, KAMerchant, ZMitt, TSkoog, MSpergel, SHTino, JAVite, GDColonno, RJZahler, RBarrish, JC α-hydroxyamide derived aminodiols as potent inhibitors of hiv protease Bioorg Med Chem Lett5:1729-1734 (1995)    Article
 
Gag-Pol polyprotein [489-587]
Name:Gag-Pol polyprotein [489-587]
Type:Enzyme Subunit
Mol. Mass.:10781.16
Organism:Human immunodeficiency virus type 1
Description:P04585[489-587]
Residue:99
BDBM914
NameBDBM914
Synonyms:Aminodiol deriv. 9a [(S,R)-3-[[(R,S)-3-[[(1,1-Dimethylethoxy)carbonyl]amino]-2-hydroxy-4-phenylbutyl]amino]-2-hydroxy-1-(phenylmethyl)propyl]carbamic Acid, 1,1-Dimethylethyl Ester | tert-butyl N-[(2S,3R)-4-{[(2R,3S)-3-{[(tert-butoxy)carbonyl]amino}-2-hydroxy-4-phenylbutyl]amino}-3-hydroxy-1-phenylbutan-2-yl]carbamate
TypeSmall organic molecule
Emp. Form.C30H45N3O6
Mol. Mass.543.6948
SMILESCC(C)(C)OC(=O)N[C@@H](Cc1ccccc1)[C@H](O)CNC[C@@H](O)[C@H](Cc1ccccc1)NC(=O)OC(C)(C)C