Reaction Details
TargetGag-Pol polyprotein [489-587]
LigandBDBM50285690
Substrate/Competitorn/a
Meas. Tech.ChEMBL_79978 (CHEMBL874137)
Ki 20±n/a nM
Citation Randad, RSLubkowska, LBujacz, ANaik, RHGulnik, SVYu, BSilva, AMunshi, SLynch, TMClanton, DJBhat, TNErickson, JW Structure-based design of achiral anthranilamides as P2/P2′ surrogates for symmetry-based HIV protease inhibitors: design, synthesis, X-ray structure, enzyme inhibition and antiviral activity Bioorg Med Chem Lett5:2557-2562 (1995)    Article
 
Gag-Pol polyprotein [489-587]
Name:Gag-Pol polyprotein [489-587]
Type:Enzyme Subunit
Mol. Mass.:10781.16
Organism:Human immunodeficiency virus type 1
Description:P04585[489-587]
Residue:99
BDBM50285690
NameBDBM50285690
Synonyms:Anthranilamide derivative | CHEMBL87309
TypeSmall organic molecule
Emp. Form.C48H46N4O10
Mol. Mass.838.8996
SMILESO[C@@H]([C@H](Cc1ccccc1)NC(=O)c1cccc(O)c1NC(=O)OCc1ccccc1)[C@H](O)[C@H](Cc1ccccc1)NC(=O)c1cccc(O)c1NC(=O)OCc1ccccc1