Reaction Details
TargetPlatelet-activating factor receptor
LigandBDBM50286012
Substrate/Competitorn/a
Meas. Tech.ChEBML_155162
Ki 2.3±n/a nM
Citation Davidsen, SKSummers, JBSweeny, DJHolms, JHAlbert, DHCarrera, GMTapang, PMagoc, TJConway, RGRhein, DA Synthesis of active metabolites of indole pyrrolothiazole paf antagonists Bioorg Med Chem Lett5:2909-2912 (1995)    Article
 
Platelet-activating factor receptor
Name:Platelet-activating factor receptor
Type:Enzyme Catalytic Domain
Mol. Mass.:39221.53
Organism:RAT
Description:PAF Platelet activating factor PTAFR RAT::P46002
Residue:341
BDBM50286012
NameBDBM50286012
Synonyms:3-{(R)-7-[1-Dimethylcarbamoyl-6-(4-fluoro-phenyl)-1H-indole-3-carbonyl]-1H-pyrrolo[1,2-c]thiazol-3-yl}-1-hydroxy-pyridinium CHEMBL317745
TypeSmall organic molecule
Emp. Form.C29H23FN4O3S
Mol. Mass.526.581
SMILESCN(C)C(=O)n1cc(C(=O)c2ccn3[C@H](SCc23)c2ccc[n+]([O-])c2)c2ccc(cc12)-c1ccc(F)cc1